PDA

Afficher la version complète : Quels jeux sur une Suse 9.2 64Bit ???



nazgul
02/05/2005, 22h23
bah voilà, tout est dans le titre...

Je cherche des jeux a faire tourner sur une Suse 9.2 64 Bit.

Si vous avez des idées...

Merci

Sirius
03/05/2005, 12h11
Warcraft 3 !! Et Frozen Bubble ! Et aussi TuxRacer !

ealias
03/05/2005, 15h33
Originally posted by Sirius@mardi 03 mai 2005 à 11:11
Warcraft 3 !! Et Frozen Bubble ! Et aussi TuxRacer !
<div align='right'><{POST_SNAPBACK}> (index.php?act=findpost&pid=35660)[/quote]


Pour installer Warcraft III sous linux on fait ca avec les mêmes Cds que sous windows
ou il faut une version linux ?

Petit Scarabé
03/05/2005, 15h52
avec cedega et point2play
je fais tourner diablo 2 sans probleme par exemple !

Sirius
03/05/2005, 17h25
En effet ! Cedega Powar !! Et regarde ici : http://www.alionet.org/index.php?showtopic=3315

nazgul
03/05/2005, 21h17
Qq'un sait ou je peux downloader Cedega pour 64bit et les rpm qui sont nécessaires à son installation ?

Merci bcp.

k-nine
03/05/2005, 22h16
Ennemy Territory qui est un FPS => ennemy-territory.com

Sirius
04/05/2005, 10h57
Nazgul, la version 32bits fonctionne à merveille http://www.alionet.org/style_emoticons/<#EMO_DIR#>/smile.gif

nazgul
10/05/2005, 20h23
Originally posted by Sirius@mercredi 04 mai 2005 à 09:57
Nazgul, la version 32bits fonctionne à merveille http://www.alionet.org/style_emoticons/<#EMO_DIR#>/smile.gif
<div align='right'><{POST_SNAPBACK}> (index.php?act=findpost&pid=35869)[/quote]

Hello Sirius,

lorsque j'exécute le script, ça se passe bien mais j'ai une erreur pendant le make :

--------- Error log - file /root/.WineCVS/sources/cvscedega/ErrorLog : ---------
make[1]: Entering directory `/root/.WineCVS/sources/cvscedega/winex/unicode'
gcc -MMD -c -I. -I. -I../include -I../include -g -O2 -Wall -fno-keep-static-consts -D__const=const -fno-strict-aliasing -D__int8=char -D__int16=short -D__int32=int "-D__int64=long long" -fPIC -D__WINE__ -D_REENTRANT -o casemap.o casemap.c
Dans le fichier inclus à partir de ../include/winnt.h:10,
à partir de ../include/windef.h:16,
à partir de ../include/wine/unicode.h:10,
à partir de casemap.c:4:
../include/basetsd.h:148:3: #error Unknown CPU architecture!
Dans le fichier inclus à partir de ../include/windef.h:16,
à partir de ../include/wine/unicode.h:10,
à partir de casemap.c:4:
../include/winnt.h:1030:2: #error You need to define a CONTEXT for your CPU
In file included from ../include/windef.h:16,
from ../include/wine/unicode.h:10,
from casemap.c:4:
../include/winnt.h:1033: error: erreur d'analyse syntaxique before '*' token
../include/winnt.h:1033: attention : type defaults to `int' in declaration of `PCONTEXT'
../include/winnt.h:1033: attention : data definition has no type or storage class
../include/winnt.h:2068: error: erreur d'analyse syntaxique before "PCONTEXT"
../include/winnt.h:2068: attention : pas de point virgule à la fin de la structure ou de l'union
../include/winnt.h:2069: attention : type defaults to `int' in declaration of `EXCEPTION_POINTERS'
../include/winnt.h:2069: attention : type defaults to `int' in declaration of `PEXCEPTION_POINTERS'
../include/winnt.h:2069: attention : data definition has no type or storage class
../include/winnt.h:2081: error: erreur d'analyse syntaxique before "PCONTEXT"
../include/winnt.h:2093: error: erreur d'analyse syntaxique before "ExceptionInfo"
../include/winnt.h:2096: error: erreur d'analyse syntaxique before "epointers"
In file included from ../include/winnls.h:5,
from ../include/wine/unicode.h:11,
from casemap.c:4:
../include/winbase.h:121: error: erreur d'analyse syntaxique before "LPCONTEXT"
../include/winbase.h:121: attention : type defaults to `int' in declaration of `LPCONTEXT'
../include/winbase.h:121: attention : data definition has no type or storage class
../include/winbase.h:123: error: erreur d'analyse syntaxique before "LPEXCEPTION_POINTERS"
../include/winbase.h:123: attention : type defaults to `int' in declaration of `LPEXCEPTION_POINTERS'
../include/winbase.h:123: attention : data definition has no type or storage class
../include/winbase.h:1362: error: erreur d'analyse syntaxique before "CONTEXT"
../include/winbase.h:1499: attention : type defaults to `int' in declaration of`CONTEXT'
../include/winbase.h:1499: error: erreur d'analyse syntaxique before '*' token
make[1]: *** [casemap.o] Erreur 1
make[1]: Leaving directory `/root/.WineCVS/sources/cvscedega/winex/unicode'
make: *** [unicode/libwine_unicode.so] Erreur 2


Error in Make

Try fixing the error based on the output above, and
run the script again, without paramaters (Eg: WineCVS.sh)

T'as pas une idée par hasard ?